Sample details: e86ad2c6a112ac1f4b2f70f74f9bde52 --

Hashes
MD5: e86ad2c6a112ac1f4b2f70f74f9bde52
SHA1: 7daff148175cd9b87e79d49dddfb4312c7dfc708
SHA256: 7fa8e9fae32cd88b9ef31b41ee3edd7dc236c312cc6d0c611a1456ec2fbe210e
SSDEEP: 12288:EriKU/OuYWh9YLlVRVVpQtzUlNjZTcvxZKrPH+m:EfYOuYZvVVpQtzU/ZTyO+m
Details
File Type: PE32
Yara Hits
YRP/Microsoft_Visual_Basic_v50 | YRP/PureBasic_4x_Neil_Hodgson_additional | YRP/PureBasic_4x_Neil_Hodgson | YRP/PureBasic4xNeilHodgson | YRP/IsPE32 | YRP/IsWindowsGUI | YRP/IsBeyondImageSize | YRP/PureBasic | YRP/domain | YRP/url | YRP/contentis_base64 | YRP/network_tcp_listen | YRP/network_smtp_raw | YRP/network_tcp_socket | YRP/network_dns | YRP/screenshot | YRP/keylogger | YRP/win_registry | YRP/win_files_operation | YRP/Advapi_Hash_API | YRP/CRC32_poly_Constant | YRP/CRC32_table | YRP/CRC32b_poly_Constant | YRP/BASE64_table | YRP/Str_Win32_Winsock2_Library | YRP/suspicious_packer_section |
Source
http://flasharts.de/mpz/mp33_beta/MP3D_Installer.exe
Strings
		!This program cannot be run in DOS mode.
`.text
`.rdata
@.data
v	N+D$
D$0T5@
D$,UPh
;D$,u 
D$(9D$
D$ PWUS
tzVj(j
D$<_^]
PRhl`E
VHtEHHt)Ht
t$@VhJ
t$<VhQ
QQSUVW
t$,PQh
t$0PSh
RtsHt,HH
t$0PWRQ
j7UUUUUW
D$(t	j
ucUUUh
l$49t$
D$&PUV
t$ PPSU
l$0PPU
HPVh,3
D$@jx@
D$ +D$
D$$+D$
t$@PQS
tJh8bE
t$ VPS
SVVh<3
t&h,bE
\$,Ph,bE
UVUh:3
t:SVSOt
OuLh43
SVSh>3
SVSh53
D$8PWjN
\$8SWQ
WVPh,3
D$8PWS
uUhHbE
t7hTbE
|$(+t$
D$ hx`E
P9l$\t$h
tzVWSUW
t$LWSU
T$ SUVWQQ
D$hQQu9
l$XPSUj
9l$4~5
E;l$4|
D$T9\$
L$0;L$(}i
D$ ;L$(
L$(SVhP
Ht\Ht,HH
\$HUVW
9t$(t@
D$`9D$(
D$@FYY;
(SVj(3
!~(_^[
Flf+Fp
Fl+Fp=
FD)^p)^l)^\
D$0RSP
W@;P s
s<u";i
W@;P(s
Gh;G\sY
Gh;G\r
M;t$8r
T$8#\$
T$8#\$
|$ 9O@
D$(+D$
D$(+D$,
D$,^][_
N(9N0u
F,][_3
\$ SVPW
l$8;t$
T$0;l$<
T$XUVW
D$0j8PW
\$(UVW
L$4QPWP
Q-_^][
F09n0u hd
j8h0dE
D$@_^][
\$ UWS
D$ PQR
PSRUhd
@`Ht(Ht
	rkj	Sh
j8h0dE
D$@;T$<u
D$H;T$Du
D$4QRP
9^xt8U
~|_]^[
;FHu,S
F@_][^
FP_][^
RPVWh(
D$(_][^
l$ ;,0
9l$,w)
D$,_][^
w)t Ht
;|$(s(
w$UPQV
D$(p9B
D$(p9B
D$()D$,
D$<;L$,
D$H9D$D
D$T^[_]
D$L^]_[
D$ VPt
<Ita<W
l$ 9l$8tc
D$4VVVVW
D$ SSU
.u?f9N
\ukf9V
D$(9D$
FP;FL|
FP;FL|
ItwItYItJ
yP;yL}4
FD;FH|
t^iL$0
9L$4tM
\$lUVW
l$X9l$T
T$0;D$l
D$X;D$T
D$X;D$T
F,uIjBj
D$ A)|$(H
t$hRSW
_^][;T$
F;t$(~
T$0+D$
v'h@$F
uI8F0uD
v4hT)F
t$90t	
89^Ht\j
`````````
	``````
`` `!"``#$````%&'```(`)*`+```,-.``/0123````4`5```````6``````789:;<````````=```>?@ABCDE````F````GH`````I`JKL`````MN```OO``P`````````Q``R`STUVW`X``````YZ[`\``]^_*
NNNNNNNNNNNNNNNNN
 !"NNN#N$N%NN&N'()NNNN%NNNNNNNN*NNNNNNNNNNNN+NN,-NNNNNNNNNNN.N/NNNNNNNNNNNNNN01NN234NN56789N:NNNNNN;<NN=>?NN@NNNNNABCNNNNNDNENNNNNFNNGHIJKNNNLNM
HPRht$F
.PhP&F
/PhP&F
D$ 9D$
D$ PWV
D$$PWV
SVWhX&F
uO8F0uJ
T$(9t$4t
\$ VPh
|$$]u0
IPh 'F
UPh,%F
/t:j/U
| h 9C
D$ Ph$*F
D$0PVj
t$,WPh
t4Wht+F
t$$WQh
F	:G	u_
C(]^_[
VWh,-F
D$"PWV
T$(8D$
D$ VWj
v"9)uj
L$ ;E4
}4_^][
D$@PhX1F
PVhl0F
PWh4/F
D$ Ph`3F
L$,;|$
D$84`E
t)UhH6F
t$D+t$@
<AtY<DtU<ItQ
u<h`8F
D$8$9F
D$84`E
D$04`E
D$,4`E
D$@4`E
D$D4`E
t$\URQP
tBUhx:F
t;^_][
T$ RPQ
tZHt/Hu^8
t	_^][
+wDF)3
GD+GHPWU
D$(Ph(<F
t3h4=F
wPhD7F
wPh|8F
wPhL#F
u+9G8u$
WPQh\4F
tm_^][Y
t(h05F
PWQhX5F
FDh\>F
t*h`@F
GC;\$$
;|$$t)
t*<-uK
9UVh,@F
D$,VPW
AUTHu;
tqhl?F
L$ QVP
tLhp8D
t+hP<D
D$$4`E
\$0t#j?S
SUh,BF
D$8PhpDF
D$<PUS
D$<PUS
D$4PUS
ua;t$$u[
D$4PUS
D$0PhdGF
D$4PUS
D$4PUS
D$cQRP
D$>PUS
D$(_^]
D$(h8KF
WSh\KF
D$(_^]
tfHtJH
\$ < tP<?
t$$h`NF
t$hHLF
D$0_^]
D$0h`MF
\$$BA;
t8_^][Y
t$PhXRF
D$ $9F
t$ QPW
u#hxSF
t$DSWj
D$@Ph`TF
u+hxSF
|$$;|$
D$H<UF
D$H<UF
D$,[_^
urWh(VF
D$ (VF
T9t$HsN
D$t_^]
D$t_^]
D$t_^]
D$ _^]
D$ _^]
D$xhL[F
u Ph8^F
D$\SUV
G(+G0P
w0hT_F
FD;F@tq
tUh(bF
\$`UVW
D$dShdcF
D$xShpeF
D$`[_^
D$`[_^
JtcJt4
								
																																																								
WWh<yF
.......
..........
 !"#$%&'()...................*+,.......-
F;t$lw=
D$@PWj
D$@PWj
9{$t"Uhh
N 09^$
N @9^4
9^,u0R
\$PUVW
D$`4`E
D$,PQRU
+L$$u7h0
D$$PQWR
uw9|$ t<
PSh<gF
D$$_^]
D$,EC;
W$_^]Y
L$,QPj
+L$dQRV
D$(;D$$
t$lPUW
D$$Pt4j
D$(;D$$
t$DPUW
_^][YY
SHELL32.DLL
SHBrowseForFolder
SHGetPathFromIDList
ws2_32.dll
getaddrinfo
freeaddrinfo
getnameinfo
Static
ComboBoxEx32
ComboBox
Button
msctls_progress32
PB_WordWrap
PB_ClientRect
RICHED20.DLL
RICHED32.DLL
OpenThemeData
CloseThemeData
GetThemeBackgroundContentRect
IsThemeBackgroundPartiallyTransparent
DrawThemeParentBackground
DrawThemeBackground
RichEdit20A
RichEdit
PB_DropAccept
PB_WindowID
DISPLAY
COMCTL32.DLL
DllGetVersion
uxtheme.dll
IsAppThemed
WindowClass_%d
PB_Focus
PB_MDI_Gadget
dwmapi.dll
DwmIsCompositionEnabled
DwmGetWindowAttribute
MDI_ChildClass
SysIPAddress32
PB_Hotkey
msimg32.dll
AlphaBlend
UUUUUU
Affffff9@
r@Kernel32.DLL
GetLongPathNameA
PostEventClass
PB_PostEventMessage
%d:%d:%d:%d
Kernel32.dll
InitOnceExecuteOnce
 deflate 1.2.8 Copyright 1995-2013 Jean-loup Gailly and Mark Adler 
incorrect header check
unknown compression method
invalid window size
unknown header flags set
header crc mismatch
invalid block type
invalid stored block lengths
too many length or distance symbols
invalid code lengths set
invalid bit length repeat
invalid code -- missing end-of-block
invalid literal/lengths set
invalid distances set
invalid literal/length code
invalid distance code
invalid distance too far back
incorrect data check
incorrect length check
								
need dictionary
stream end
file error
stream error
data error
insufficient memory
buffer error
incompatible version
Qkkbal
[-&LMb#{'
w+OQvr
)\ZEo^m/
H*0"ZOW
l!;b	F
mj>zjZ
IiGM>nw
ewh/?y
OZw3(?
V_:X1:
 inflate 1.2.8 Copyright 1995-2013 Mark Adler 
compression
%s: compression option needs a compression name
deflate
compression-level
encryption
traditional
zipcrypt
ZipCrypt
encryption not supported
aes128
aes256
%s: unknown encryption '%s'
experimental
fakecrc32
hdrcharset
%s: hdrcharset option needs a character-set name
archive_write_zip_set_compression_deflate
Can only use archive_write_zip_set_compression_deflate with zip format
Can only use archive_write_zip_set_compression_store with zip format
archive_write_set_format_zip
Can't allocate zip data
Can't allocate compression buffer
Filetype not supported
Files > 4GB require Zip64 extensions
Archives > 4GB require Zip64 extensions
Can't allocate zip header data
Can't allocate memory for Pathname
Can't translate Pathname '%s' to %s
Can't allocate memory  for Symlink
Can't init deflate compressor
Failed to encrypt file
Invalid ZIP compression type
Encryption needs passphrase
Can't generate random number for encryption
Decryption is unsupported due to lack of crypto library
Failed to initialize HMAC-SHA1
uncompressed
shrinking
reduced-1
reduced-2
reduced-3
reduced-4
imploded
reserved
deflation
deflation-64-bit
ibm-terse
ibm-terse-new
ibm-lz777
wav-pack
ppmd-1
Truncated ZIP file header
Damaged Zip archive
Pathname cannot be converted from %s to current locale.
Inconsistent CRC32 values
Inconsistent compressed size: %jd in central directory, %jd in local header
Inconsistent uncompressed size: %jd in central directory, %jd in local header
Zip file with oversized link entry
Truncated Zip file
Can't allocate memory for Symlink
Symlink cannot be converted from %s to current locale.
Read error skipping symlink target name
ZIP %d.%d (%s)
Truncated ZIP file data
ZIP bad Authentication code
Can't initialize ZIP decompression.
No memory for ZIP decompression
Truncated ZIP file body
Out of memory for ZIP decompression
ZIP decompression failed (%d)
Truncated ZIP end-of-file record
Unsupported encryption format version: %u
Unknown encryption algorithm: %u
Unknown encryption flag: %u
Encrypted file is unsupported
Corrupted ZIP file data
No memory for ZIP decryption
Truncated Zip encrypted body: only %jd bytes available
Incorrect passphrase
Passphrase required for this entry
Too many incorrect passphrases
Unsupported ZIP compression method (%s)
ZIP compressed data is wrong size (read %jd, expected %jd)
ZIP uncompressed data is wrong size (read %jd, expected %jd)
ZIP bad CRC: 0x%lx should be 0x%lx
compat-2x
zip: hdrcharset option needs a character-set name
ignorecrc32
mac-ext
Out  of memory
archive_read_support_format_zip
Invalid central directory signature
__MACOSX/
Mac metadata is too large: %jd > 4M bytes
Can't allocate memory for Mac metadata
archive_read_support_format_zip_seekable
No memory
archive_write_data_block not supported
archive_write_set_bytes_per_block
archive_write_get_bytes_per_block
archive_write_set_bytes_in_last_block
archive_write_get_bytes_in_last_block
archive_write_set_skip_file
Can't allocate data for output buffering
write overrun
archive_write_open
archive_write_close
archive_write_free
archive_write_header
Format must be set before you can write to an archive.
Can't add archive to itself
archive_write_finish_entry
archive_write_data
Can't convert '%s' to WCS
Can't convert '%S' to MBS
Failed to open '%s'
Failed to open '%S'
Couldn't stat '%s'
Couldn't stat '%S'
Write error
archive_read_extract_set_skip_file
Negative skip requested.
Current client reader does not support seeking a device
archive_read_set_open_callback
archive_read_set_read_callback
archive_read_set_skip_callback
archive_read_set_seek_callback
archive_read_set_close_callback
archive_read_set_switch_callback
archive_read_set_callback_data2
No memory.
Invalid index specified.
archive_read_add_callback_data
archive_read_open
No reader function provided to archive_read_open
Input requires too many filters for decoding
archive_read_next_header
Premature end-of-file.
No formats registered
Unrecognized archive format
archive_read_header_position
Encountered out-of-order sparse blocks
archive_read_data_skip
archive_seek_data_block
Internal error: No format_seek_data_block function registered
archive_read_data_block
Internal error: No format_read_data_block function registered
archive_read_close
archive_read_free
__archive_read_register_format
Not enough slots for format registration
Not enough slots for filter registration
Unable to allocate copy buffer
Truncated input file (needed %jd bytes, only %jd available)
Can't stat '%S'
Can't stat '%s'
Error reading stdin
Error reading '%s'
Error reading '%S'
Error seeking in stdin
Error seeking in '%s'
Error seeking in '%S'
header
closed
archive_write
archive_read
archive_write_disk
archive_read_disk
archive_match
PROGRAMMER ERROR: Function 
 invoked with invalid archive handle.
PROGRAMMER ERROR: Function '%s' invoked on '%s' archive object, which is not supported.
INTERNAL ERROR: Function '%s' invoked with archive structure in state '%s', should be in state '%s'
Fatal Internal Error in libarchive: 
libarchive 3.1.2
 zlib/
 liblzma/
 bz2lib/
UTF-16BE
UTF-16LE
ASMO-708
CHINESE
CP1025
DOS-720
DOS-862
EUC-CN
EUC-JP
EUC-KR
GB18030
GB2312
HEBREW
HZ-GB-2312
IBM273
IBM277
IBM278
IBM280
IBM284
IBM285
IBM290
IBM297
IBM367
IBM420
IBM423
IBM424
IBM819
IBM871
IBM880
IBM905
IBM924
ISO-8859-1
ISO-8859-13
ISO-8859-15
ISO-8859-2
ISO-8859-3
ISO-8859-4
ISO-8859-5
ISO-8859-6
ISO-8859-7
ISO-8859-8
ISO-8859-9
ISO8859-1
ISO8859-13
ISO8859-15
ISO8859-2
ISO8859-3
ISO8859-4
ISO8859-5
ISO8859-6
ISO8859-7
ISO8859-8
ISO8859-9
KOI8-R
KOI8-U
KS_C_5601-1987
LATIN1
LATIN2
MACINTOSH
SHIFT-JIS
SHIFT_JIS
US-ASCII
UTF-16
X-EUROPA
X-MAC-ARABIC
X-MAC-CE
X-MAC-CHINESEIMP
X-MAC-CHINESETRAD
X-MAC-CROATIAN
X-MAC-CYRILLIC
X-MAC-GREEK
X-MAC-HEBREW
X-MAC-ICELANDIC
X-MAC-JAPANESE
X-MAC-KOREAN
X-MAC-ROMANIAN
X-MAC-THAI
X-MAC-TURKISH
X-MAC-UKRAINIAN
Chinese_Taiwan
Chinese_People's Republic of China
Czech_Czech Republic
Danish_Denmark
Dutch_Netherlands
Dutch_Belgium
English_United States
English_Australia
English_Canada
English_New Zealand
English_United Kingdom
Finnish_Finland
French_France
French_Belgium
French_Canada
French_Switzerland
German_Germany
German_Austria
German_Switzerland
Greek_Greece
Hungarian_Hungary
Icelandic_Iceland
Italian_Italy
Italian_Switzerland
Japanese_Japan
Korean_Korea
Norwegian (BokmOl)_Norway
Norwegian-Nynorsk_Norway
Polish_Poland
Portuguese_Portugal
Portuguese_Brazil
Russian_Russia
Slovak_Slovakia
Spanish_Spain
Spanish_Mexico
Swedish_Sweden
Turkish_Turkey
Out of memory
Programing error
UTF16BE
UTF16LE
CP_ACP
CP_OEMCP
WINDOWS-
Could not allocate memory for a string conversion object
A character-set conversion not fully supported on this platform
archive_write_set_passphrase
Empty passphrase is unacceptable
Can't allocate data for passphrase
archive_write_set_passphrase_callback
Can't allocate memory
archive_read_add_passphrase
archive_read_set_passphrase_callback
0123456789abcdef
(null)
default:
0123456789
Couldn't stat fd %d
1.0.6, 6-Sept-2010
easy handle already used in multi handle
CONNECT_ONLY is required!
Failed to get recent socket
<no protocol>
identity
RELOAD
Set-Cookie:
CURLOPT_SSL_VERIFYHOST no longer supports 1 as value!
Closing connection %ld
Connection %ld seems to be dead!
Found bundle for host %s: %p
Server doesn't support pipelining
Connection #%ld isn't open enough, can't reuse
Connection cache is full, closing the oldest one.
Connected to %s (%s) port %ld (#%ld)
IDN support not present, can't parse Unicode domains
Protocol "%s" not supported or disabled in libcurl
Illegal characters found in URL
%15[^:]:%[^
:]://%[^
/?]%[^
/?]%[^
<url> malformed
Rebuilt URL to: %s
Please URL encode %% as %%25, see RFC 6874.
Invalid IPv6 address format
no_proxy
NO_PROXY
_proxy
http_proxy
all_proxy
ALL_PROXY
socks5h
socks5
socks4a
socks4
[%*45[0123456789abcdefABCDEF:.]%c
IPv6 numerical address used in URL without brackets
;type=%c
%s://%s%s%s:%hu%s%s%s
Port number out of range
Couldn't find host %s in the _netrc file; using defaults
anonymous
ftp@example.com
Couldn't resolve host '%s'
Couldn't resolve proxy '%s'
%s://%s
memory shortage
Found connection %ld, with requests in the pipe (%zu)
We can reuse, but we want a new connection anyway
Re-using existing connection! (#%ld) with %s %s
No connections available.
NTLM picked AND auth done set, clear picked!
NTLM-proxy picked AND auth done set, clear picked!
User-Agent: %s
Connection #%ld to host %s left intact
ignoring failed cookie_init for %s
%1023[^;
 =] =%4999[^;
secure
httponly
domain
skipped cookie with bad tailmatch domain: %s
version
max-age
expires
#HttpOnly_
Replaced
%s cookie %s="%s" for domain %s, path %s, expire %ld
unknown
%s%s%s	%s	%s	%s	%ld	%s	%s
# Netscape HTTP Cookie File
# http://curl.haxx.se/docs/http-cookies.html
# This file was generated by libcurl! Edit at your own risk.
# Fatal libcurl error
WARNING: failed to save cookies in %s
WARNING: Using weak random seed
Unrecognized parameter value passed via CURLOPT_SSLVERSION
-----BEGIN PUBLIC KEY-----
-----END PUBLIC KEY-----
Send failure: %s
Recv failure: %s
Write callback asked for PAUSE when not supported!
Failed writing body (%zu != %zu)
Failed writing header
Header
[%s %s %s]
Curl_poll(%d ds, %d ms)
Pipe broke: handle %p, url = %s
In state %d with no easy_conn, bail out!
Resolving timed out after %ld milliseconds
Connection timed out after %ld milliseconds
Operation timed out after %ld milliseconds with %ld out of %ld bytes received
Operation timed out after %ld milliseconds with %ld bytes received
Hostname was found in DNS cache
Internal error clearing splay node = %d
Internal error removing splay node = %d
Failed to set SO_KEEPALIVE on fd %d
Failed to set SIO_KEEPALIVE_VALS on fd %d: %d
Couldn't bind to interface '%s'
Local Interface %s is ip %s using address family %i
Name '%s' family %i resolved to '%s' family %i
Couldn't bind to '%s'
getsockname() failed with errno %d: %s
Local port: %hu
Bind to local port %hu failed, trying next
bind failed with errno %d: %s
getpeername() failed with errno %d: %s
ssrem inet_ntop() failed with errno %d: %s
ssloc inet_ntop() failed with errno %d: %s
Connection time-out
After %ldms connect time, move on!
Connection failed
connect to %s port %ld failed: %s
Failed to connect to %s port %ld: %s
Could not set TCP_NODELAY: %s
TCP_NODELAY set
sa_addr inet_ntop() failed with errno %d: %s
  Trying %s...
Immediate connect fail for %s: %s
Hostname in DNS cache was stale, zapped
Hostname %s was found in DNS cache
timeout on name lookup is not supported
%255[^:]:%d
Couldn't parse CURLOPT_RESOLVE removal entry '%s'!
%255[^:]:%d:%255s
Couldn't parse CURLOPT_RESOLVE entry '%s'!
Address in '%s' found illegal!
Added %s:%d:%s to DNS cache
security.dll
secur32.dll
InitSecurityInterfaceA
Proxy-
%sAuthorization: Basic %s
Rewind stream after send
NTLM send, close instead of sending %ld bytes
The requested URL returned error: %d
Negotiate
Digest
Proxy-authorization:
Authorization:
Server
%s auth using %s with user '%s'
Authentication problem. Ignoring this.
Ignoring duplicate digest auth header.
Empty reply from server
Expect:
100-continue
Expect: 100-continue
Content-Type:
Content-Length
Connection
Invalid TIMEVALUE
%s, %02d %s %4d %02d:%02d:%02d GMT
If-Modified-Since: %s
If-Unmodified-Since: %s
Last-Modified: %s
User-Agent:
Referer:
Referer: %s
Cookie:
Accept-Encoding:
Accept-Encoding: %s
Transfer-Encoding:
chunked
Chunky upload is not supported by HTTP 1.0
Transfer-Encoding: chunked
Host: %s%s%s
Host: %s%s%s:%hu
ftp://
;type=
Accept:
Accept: */*
Could not seek stream
Could only read %ld bytes from the input
File already completely uploaded
Range:
Range: bytes=%s
Content-Range:
Content-Range: bytes 0-%ld/%ld
Content-Range: bytes %s%ld/%ld
Content-Range: bytes %s/%ld
ftp://%s:%s@%s
Proxy-Connection:
Proxy-Connection: Keep-Alive
%s HTTP/%s
%s%s%s%s%s%s%s%s%s%s%s
Cookie: 
%s%s=%s
Content-Length: 0
Failed sending POST request
Internal HTTP POST error!
Content-Length:
Content-Length: %ld
Could not get Content-Type header line!
Failed sending PUT request
Content-Type: application/x-www-form-urlencoded
Failed sending HTTP POST request
Failed sending HTTP request
upload completely sent off: %ld out of %ld bytes
Avoided giant realloc for header (max is %d)!
Failed to alloc memory for big header!
The requested URL returned error: %s
Received 101
no chunk, no close, no size. Assume close to signal end
HTTP error before end of send, stop sending
Keep sending data to get tossed away!
 HTTP/%d.%d %d
Lying server, not serving HTTP/2
 HTTP %3d
 RTSP/%d.%d %3d
HTTP 1.0, assume close after body
Maximum file size exceeded
Negative content-length: %ld, closing after transfer
Server:
keep-alive
HTTP/1.0 proxy connection set to keep alive!
HTTP/1.1 proxy connection set close!
Connection:
HTTP/1.0 connection set to keep alive!
x-gzip
compress
x-compress
Content-Encoding:
Last-Modified:
WWW-Authenticate:
Proxy-authenticate:
Location:
EHLO %s
HELO %s
STARTTLS
AUTH %s %s
AUTH %s
No known authentication mechanisms supported!
MAIL FROM:%s
MAIL FROM:%s AUTH=%s
MAIL FROM:%s AUTH=%s SIZE=%s
MAIL FROM:%s SIZE=%s
RCPT TO:%s
RCPT TO:<%s>
Got unexpected smtp-server response: %d
STARTTLS denied. %c
Remote access denied: %d
STARTTLS not supported.
Authentication cancelled
Command failed: %d
MAIL failed: %d
RCPT failed: %d
DATA failed: %d
localhost
Failed to alloc scratch buffer!
Conn: %ld (%p) Receive pipe weight: (%ld/%zu), penalized: %s
Site %s:%d is pipeline blacklisted
Server %s is blacklisted
%sAuthorization: Digest %s
SOCKS4 communication to %s:%d
%hu.%hu.%hu.%hu
SOCKS4 connect to %s (locally resolved)
Failed to resolve "%s" for SOCKS4 connect.
Too long SOCKS proxy name, can't use!
Failed to send SOCKS4 connect request.
Failed to receive SOCKS4 connect request ack.
SOCKS4 reply has wrong version, version should be 4.
SOCKS4%s request granted.
Can't complete SOCKS4 connection to %d.%d.%d.%d:%d. (%d), request rejected or failed.
Can't complete SOCKS4 connection to %d.%d.%d.%d:%d. (%d), request rejected because SOCKS server cannot connect to identd on the client.
Can't complete SOCKS4 connection to %d.%d.%d.%d:%d. (%d), request rejected because the client program and identd report different user-ids.
Can't complete SOCKS4 connection to %d.%d.%d.%d:%d. (%d), Unknown.
SOCKS5: server resolving disabled for hostnames of length > 255 [actual len=%zu]
SOCKS5: no connection here
SOCKS5: connection timeout
SOCKS5: error occurred during connection
Unable to send initial SOCKS5 request.
SOCKS5 nothing to read
SOCKS5 read timeout
SOCKS5 read error occurred
Unable to receive initial SOCKS5 response.
Received invalid version in initial SOCKS5 response.
Unable to negotiate SOCKS5 GSS-API context.
Failed to send SOCKS5 sub-negotiation request.
Unable to receive SOCKS5 sub-negotiation response.
User was rejected by the SOCKS5 server (%d %d).
No authentication method was acceptable. (It is quite likely that the SOCKS5 server wanted a username/password, since none was supplied to the server on this connection.)
No authentication method was acceptable.
Undocumented SOCKS5 mode attempted to be used by server.
Failed to resolve "%s" for SOCKS5 connect.
SOCKS5 GSS-API protection not yet implemented.
Failed to send SOCKS5 connect request.
Failed to receive SOCKS5 connect request ack.
SOCKS5 reply has wrong version, version should be 5.
Can't complete SOCKS5 connection to %d.%d.%d.%d:%d. (%d)
Can't complete SOCKS5 connection to %s:%d. (%d)
Can't complete SOCKS5 connection to %02x%02x:%02x%02x:%02x%02x:%02x%02x:%02x%02x:%02x%02x:%02x%02x:%02x%02x:%d. (%d)
NTLM handshake rejected
NTLM handshake failure (internal error)
%sAuthorization: NTLM %s
operation aborted by callback
Read callback asked for PAUSE when not supported!
read function returned funny value
seek callback returned error %d
the ioctl callback returned %d
ioctl callback returned error %d
necessary data rewind wasn't possible
The requested document is not new enough
The requested document is not old enough
Rewinding stream by : %zd bytes on url %s (zero-length body)
Excess found in a non pipelined read: excess = %zd url = %s (zero-length body)
Ignoring the response-body
The entire document is already downloaded
HTTP server doesn't seem to support byte ranges. Cannot resume.
Simulate a HTTP 304 response!
Failed writing data
%s in chunked-encoding
Leftovers after chunking: %zu bytes
Rewinding %zu bytes
Rewinding stream by : %zu bytes on url %s (size = %ld, maxdownload = %ld, bytecount = %ld, nread = %zd)
Excess found in a non pipelined read: excess = %zu, size = %ld, maxdownload = %ld, bytecount = %ld
we are done reading and this is set to close, stop send
We are completely uploaded and fine
select/poll returned error
Done waiting for 100-continue
transfer closed with %ld bytes remaining to read
transfer closed with outstanding read data remaining
No URL set!
%15[^?&/:]://%c
Maximum (%ld) redirects followed
Issue another request to this URL: '%s'
Switch from POST to GET
Disables POST, goes with %s
Re-used connection seems dead, get a new one
Connection died, retrying a fresh connect
--:--:--
%2ld:%02ld:%02ld
%3ldd %02ldh
%2ld.%0ldM
Callback aborted
** Resuming transfer from byte position %ld
  %% Total    %% Received %% Xferd  Average Speed   Time    Time     Time  Current
                                 Dload  Upload   Total   Spent    Left  Speed
%3ld %s  %3ld %s  %3ld %s  %s  %s %s %s %s %s
@Establish HTTP proxy tunnel to %s:%hu
%s:%hu
CONNECT
%s%s%s:%hu
Host: %s
CONNECT %s HTTP/%s
%s%s%s%s
Failed sending CONNECT to proxy
Proxy CONNECT aborted due to timeout
Proxy CONNECT aborted due to select/poll error
Proxy CONNECT connection closed
Proxy CONNECT aborted
chunk reading DONE
Read %zd bytes of chunk, continue
Ignore %ld bytes of response-body
%zd bytes of chunk left
Proxy CONNECT followed by %zd bytes of opaque data. Data ignored (known bug #39)
CONNECT responded chunked
HTTP/1.%d %d
TUNNEL_STATE switched to: %d
Connect me again please
Received HTTP code %d from proxy after CONNECT
Proxy replied OK to CONNECT request
0123456789abcdefghijklmnopqrstuvwxyz
0123456789ABCDEFGHIJKLMNOPQRSTUVWXYZ
Operation too slow. Less than %ld bytes/sec transferred the last %ld seconds
_netrc
%s%s%s
machine
password
%%%02X
0123456789
0123456789abcdef
0123456789ABCDEF
Monday
Tuesday
Wednesday
Thursday
Friday
Saturday
Sunday
%31[ABCDEFGHIJKLMNOPQRSTUVWXYZabcdefghijklmnopqrstuvwxyz]
%02d:%02d:%02d
%02d:%02d
schannel: SSL/TLS connection with %s port %hu (step 1/3)
schannel: re-using existing credential handle
schannel: checking server certificate revocation
schannel: disable server certificate revocation checks
schannel: verifyhost setting prevents Schannel from comparing the supplied target name with the subject names in server certificates. Also disables SNI.
schannel: unable to allocate memory
Microsoft Unified Security Protocol Provider
schannel: SNI or certificate check failed: %s
schannel: AcquireCredentialsHandle failed: %s
schannel: using IP address, SNI is not supported by OS.
schannel: initial InitializeSecurityContext failed: %s
schannel: sending initial handshake data: sending %lu bytes...
schannel: failed to send initial handshake data: sent %zd of %lu bytes
schannel: sent initial handshake data: sent %zd bytes
schannel: SSL/TLS connection with %s port %hu (step 2/3)
schannel: unable to re-allocate memory
schannel: failed to receive handshake, need more data
schannel: failed to receive handshake, SSL/TLS connection failed
schannel: encrypted data buffer: offset %zu length %zu
schannel: received incomplete message, need more data
schannel: sending next handshake data: sending %lu bytes...
schannel: failed to send next handshake data: sent %zd of %lu bytes
schannel: next InitializeSecurityContext failed: %s
schannel: encrypted data length: %lu
schannel: SSL/TLS handshake complete
schannel: SSL/TLS connection with %s port %hu (step 3/3)
schannel: failed to setup sequence detection
schannel: failed to setup replay detection
schannel: failed to setup confidentiality
schannel: failed to setup memory allocation
schannel: failed to setup stream orientation
schannel: incremented credential handle refcount = %d
schannel: old credential handle is stale, removing
schannel: failed to store credential handle
schannel: stored credential handle in session cache
SSL/TLS connection timeout
select/poll on SSL/TLS socket, errno: %d
schannel: timed out sending data (bytes sent: %zd)
select/poll on SSL socket, errno: %d
schannel: client wants to read %zu bytes
schannel: encrypted data got %zd
schannel: failed to decrypt data, need more data
schannel: decrypted data length: %lu
schannel: decrypted data added: %zu
schannel: decrypted data cached: offset %zu length %zu
schannel: encrypted data cached: offset %zu length %zu
schannel: remote party requests SSL/TLS renegotiation
schannel: renegotiating SSL/TLS connection
schannel: SSL/TLS connection renegotiated
schannel: decrypted data buffer: offset %zu length %zu
schannel: decrypted data returned %zd
schannel: server closed the connection
schannel: failed to read data from server: %s
schannel: shutting down SSL/TLS connection with %s port %hu
schannel: ApplyControlToken failure: %s
schannel: failed to send close msg: %s (bytes written: %zd)
schannel: clear security context handle
schannel: decremented credential handle refcount = %d
schannel: clear credential handle
WinSSL
ABCDEFGHIJKLMNOPQRSTUVWXYZabcdefghijklmnopqrstuvwxyz0123456789+/
ABCDEFGHIJKLMNOPQRSTUVWXYZabcdefghijklmnopqrstuvwxyz0123456789-_
%c%c==
%c%c%c=
%c%c%c%c
No error
Unsupported protocol
Failed initialization
URL using bad/illegal format or missing URL
A requested feature, protocol or option was not found built-in in this libcurl due to a build-time decision.
Couldn't resolve proxy name
Couldn't resolve host name
Couldn't connect to server
FTP: weird server reply
Access denied to remote resource
FTP: The server failed to connect to data port
FTP: Accepting server connect has timed out
FTP: The server did not accept the PRET command.
FTP: unknown PASS reply
FTP: unknown PASV reply
FTP: unknown 227 response format
FTP: can't figure out the host in the PASV response
Error in the HTTP2 framing layer
FTP: couldn't set file type
Transferred a partial file
FTP: couldn't retrieve (RETR failed) the specified file
Quote command returned error
HTTP response code said error
Failed writing received data to disk/application
Upload failed (at start/before it took off)
Failed to open/read local data from file/application
Timeout was reached
FTP: command PORT failed
FTP: command REST failed
Requested range was not delivered by the server
Internal problem setting up the POST
SSL connect error
Couldn't resume download
Couldn't read a file:// file
LDAP: cannot bind
LDAP: search failed
A required function in the library was not found
Operation was aborted by an application callback
A libcurl function was given a bad argument
Failed binding local connection end
Number of redirects hit maximum amount
An unknown option was passed in to libcurl
Malformed telnet option
SSL peer certificate or SSH remote key was not OK
Server returned nothing (no headers, no data)
SSL crypto engine not found
Can not set SSL crypto engine as default
Failed to initialise SSL crypto engine
Failed sending data to the peer
Failure when receiving data from the peer
Problem with the local SSL certificate
Couldn't use specified SSL cipher
Peer certificate cannot be authenticated with given CA certificates
Problem with the SSL CA cert (path? access rights?)
Unrecognized or bad HTTP Content or Transfer-Encoding
Invalid LDAP URL
Requested SSL level failed
Failed to shut down the SSL connection
Failed to load CRL file (path? access rights?, format?)
Issuer check against peer certificate failed
Send failed since rewinding of the data stream failed
Login denied
TFTP: File Not Found
TFTP: Access Violation
Disk full or allocation exceeded
TFTP: Illegal operation
TFTP: Unknown transfer ID
Remote file already exists
TFTP: No such user
Conversion failed
Caller must register CURLOPT_CONV_ callback options
Remote file not found
Error in the SSH layer
Socket not ready for send/recv
RTSP CSeq mismatch or invalid CSeq
RTSP session error
Unable to parse FTP file list
Chunk callback failed
The max connection limit is reached
SSL public key does not match pinned public key
SSL server certificate status verification FAILED
Unknown error
Please call curl_multi_perform() soon
Invalid multi handle
Invalid easy handle
Internal error
Invalid socket argument
Unknown option
The easy handle is already added to a multi handle
Unknown share option
Share currently in use
Invalid share handle
Feature not enabled in this library
CURLSHcode unknown
Call interrupted
Bad file
Bad access
Bad argument
Invalid arguments
Out of file descriptors
Call would block
Blocking call in progress
Descriptor is not a socket
Need destination address
Bad message size
Bad protocol
Protocol option is unsupported
Protocol is unsupported
Socket is unsupported
Operation not supported
Address family not supported
Protocol family not supported
Address already in use
Address not available
Network down
Network unreachable
Network has been reset
Connection was aborted
Connection was reset
No buffer space
Socket is already connected
Socket is not connected
Socket has been shut down
Too many references
Timed out
Connection refused
Loop??
Name too long
Host down
Host unreachable
Not empty
Process limit reached
Too many users
Bad quota
Something is stale
Remote error
Disconnected
Winsock library is not ready
Winsock library not initialised
Winsock version not supported
Host not found
Host not found, try again
Unrecoverable error in call to nameserver
No data record of requested type
Unknown error %d (%#x)
SEC_E_ALGORITHM_MISMATCH
SEC_E_BAD_BINDINGS
SEC_E_BAD_PKGID
SEC_E_BUFFER_TOO_SMALL
SEC_E_CANNOT_INSTALL
SEC_E_CANNOT_PACK
SEC_E_CERT_EXPIRED
SEC_E_CERT_UNKNOWN
SEC_E_CERT_WRONG_USAGE
SEC_E_CONTEXT_EXPIRED
SEC_E_CROSSREALM_DELEGATION_FAILURE
SEC_E_CRYPTO_SYSTEM_INVALID
SEC_E_DECRYPT_FAILURE
SEC_E_DELEGATION_POLICY
SEC_E_DELEGATION_REQUIRED
SEC_E_DOWNGRADE_DETECTED
SEC_E_ENCRYPT_FAILURE
SEC_E_ILLEGAL_MESSAGE
SEC_E_INCOMPLETE_CREDENTIALS
SEC_E_INCOMPLETE_MESSAGE
SEC_E_INSUFFICIENT_MEMORY
SEC_E_INTERNAL_ERROR
SEC_E_INVALID_HANDLE
SEC_E_INVALID_PARAMETER
SEC_E_INVALID_TOKEN
SEC_E_ISSUING_CA_UNTRUSTED
SEC_E_ISSUING_CA_UNTRUSTED_KDC
SEC_E_KDC_CERT_EXPIRED
SEC_E_KDC_CERT_REVOKED
SEC_E_KDC_INVALID_REQUEST
SEC_E_KDC_UNABLE_TO_REFER
SEC_E_KDC_UNKNOWN_ETYPE
SEC_E_LOGON_DENIED
SEC_E_MAX_REFERRALS_EXCEEDED
SEC_E_MESSAGE_ALTERED
SEC_E_MULTIPLE_ACCOUNTS
SEC_E_MUST_BE_KDC
SEC_E_NOT_OWNER
SEC_E_NO_AUTHENTICATING_AUTHORITY
SEC_E_NO_CREDENTIALS
SEC_E_NO_IMPERSONATION
SEC_E_NO_IP_ADDRESSES
SEC_E_NO_KERB_KEY
SEC_E_NO_PA_DATA
SEC_E_NO_S4U_PROT_SUPPORT
SEC_E_NO_TGT_REPLY
SEC_E_OUT_OF_SEQUENCE
SEC_E_PKINIT_CLIENT_FAILURE
SEC_E_PKINIT_NAME_MISMATCH
SEC_E_POLICY_NLTM_ONLY
SEC_E_QOP_NOT_SUPPORTED
SEC_E_REVOCATION_OFFLINE_C
SEC_E_REVOCATION_OFFLINE_KDC
SEC_E_SECPKG_NOT_FOUND
SEC_E_SECURITY_QOS_FAILED
SEC_E_SHUTDOWN_IN_PROGRESS
SEC_E_SMARTCARD_CERT_EXPIRED
SEC_E_SMARTCARD_CERT_REVOKED
SEC_E_SMARTCARD_LOGON_REQUIRED
SEC_E_STRONG_CRYPTO_NOT_SUPPORTED
SEC_E_TARGET_UNKNOWN
SEC_E_TIME_SKEW
SEC_E_TOO_MANY_PRINCIPALS
SEC_E_UNFINISHED_CONTEXT_DELETED
SEC_E_UNKNOWN_CREDENTIALS
SEC_E_UNSUPPORTED_FUNCTION
SEC_E_UNSUPPORTED_PREAUTH
SEC_E_UNTRUSTED_ROOT
SEC_E_WRONG_CREDENTIAL_HANDLE
SEC_E_WRONG_PRINCIPAL
SEC_I_COMPLETE_AND_CONTINUE
SEC_I_COMPLETE_NEEDED
SEC_I_CONTEXT_EXPIRED
SEC_I_CONTINUE_NEEDED
SEC_I_INCOMPLETE_CREDENTIALS
SEC_I_LOCAL_LOGON
SEC_I_NO_LSA_CONTEXT
SEC_I_RENEGOTIATE
SEC_I_SIGNATURE_NEEDED
%s (0x%04X%04X)
%s - %s
%d.%d.%d.%d
getaddrinfo(3) failed for %s:%d
image/gif
image/jpeg
text/plain
text/html
application/xml
application/octet-stream
; filename="%s"
Content-Type: multipart/form-data
%s; boundary=%s
Content-Disposition: form-data; name="
Content-Type: multipart/mixed; boundary=%s
Content-Disposition: attachment
Content-Type: %s
couldn't open file "%s"
--%s--
--%s--
------------------------%08x%08x
Negotiate handshake failure (empty challenge message)
%sAuthorization: Negotiate %s
Too long hexadecimal number
Illegal or missing hexadecimal sequence
Malformed encoding found
Bad content-encoding found
CRAM-MD5
DIGEST-MD5
GSSAPI
EXTERNAL
XOAUTH2
%s %02x%02x%02x%02x%02x%02x%02x%02x%02x%02x%02x%02x%02x%02x%02x%02x
user=%s
auth=Bearer %s
Unsupported SASL authentication mechanism
server response timeout
select/poll error
response reading failed
Excessive server response line length received, %zd bytes. Stripping
DIGEST-MD5 handshake failure (empty challenge message)
WDigest
NTLM handshake failure (empty type-2 message)
NTLM handshake failure (type-3 message): Status=%x
Kerberos
GSSAPI handshake failure (empty challenge message)
GSSAPI handshake failure (empty security message)
GSSAPI handshake failure (invalid security data)
GSSAPI handshake failure (invalid security layer)
SSPI error: %s failed: %s
AcquireCredentialsHandle
Failed to acquire credentials.
InitializeSecurityContext
Failed to initialise security context.
Failed to send SSPI authentication request.
Failed to send SSPI authentication token.
Failed to receive SSPI authentication response.
User was rejected by the SOCKS5 server (%u %u).
Invalid SSPI authentication response type (%u %u).
Failed to receive SSPI authentication token.
QueryCredentialAttributes
Failed to determine user name.
SOCKS5 server authencticated user %s with GSS-API.
integrity
confidentiality
SOCKS5 server supports GSS-API %s data protection.
QueryContextAttributes
Failed to query security context attributes.
EncryptMessage
Failed to send SSPI encryption request.
Failed to send SSPI encryption type.
Failed to receive SSPI encryption response.
Invalid SSPI encryption response type (%u %u).
Failed to receive SSPI encryption type.
DecryptMessage
Invalid SSPI encryption response length (%lu).
out GSS-API data
 GSS-API integrity
 GSS-API confidentiality
SOCKS5 access with%s protection granted.
6\PB_GadgetStack_%i
mp33_beta/lib32/Lib32.zip
Please choose the Path of Purebasic
Help File not found - Please check your internet connection & try again later...
Purebasic 5.24 < 5.31
 Successfully!
Purebasic 5.40 LTS < 
x86 (32 bit)
Wrote 
mp33_beta/lib64/Lib64.zip
Decompressing demo files... 
Error 404 (64-bit)
mp33_beta/dx9/pb540_32_tc/MP3D_Library.zip
mp33_beta/Examples/MP3D_Demos.zip
Purebasic directory
Threadsafe (PB 5.40 LTS only)
Examples\MP3D Demos\
File(s) not found...
Please check your internet connection & try again later...
Exit Installer
MP3D_libary
' not found...
Please check your internet connection & try again later...
MP3D_Library
mp33_beta/dx9/pb522_64/MP3D_Library.zip
mp33_beta/Help/MP3D_Library.chm
MP3D Demos
MP3D Installer - V.0.52
PureLibraries\Windows\Libraries\
File(s): '
Examples\
 ERROR !
SubSystems\dx9\purelibraries\
Hello to all, have fun with MP3D!
mp33_beta/dx9/pb540_64/MP3D_Library.zip
 Successfully!
t write File: 
PUREBASIC_HOME
PureBasic.exe\DefaultIcon
File(s) not found in directory '
Install
MP3D Helpfile
mp33_beta/dx9/pb522_32/MP3D_Library.zip
mp33_beta/dx9/pb540_64_tc/MP3D_Library.zip
Help\MP3D_Library.chm
SubSystems\dx9\
Error :: 404
Select OS Type: 
Error 404 (32-bit)
http://www.flasharts.de/mpz/
Search Path
Miscellaneous
x64 (64 bit)
mp33_beta/dx9/pb540_32/MP3D_Library.zip
 ERROR !
Select PB Version: 
File(s) not found - Please check your internet connection & try again later...
DX9 Libarys
Wrote File: 
memset
MSVCRT.dll
GetModuleHandleA
HeapCreate
HeapDestroy
ExitProcess
KERNEL32.dll
GdipDeleteFont
GdipDeleteGraphics
GdipDeletePath
GdipDeleteMatrix
GdipDeletePen
GdipDeleteStringFormat
GdipFree
GdipGetDpiX
GdipGetDpiY
gdiplus.dll
strncpy
strlen
_strdup
memcpy
sprintf
strncmp
strcmp
malloc
fclose
??3@YAXPAX@Z
memmove
strcat
strcpy
_stricmp
tolower
calloc
_errno
localtime
strrchr
memchr
mktime
_close
_wopen
realloc
_setmode
_lseeki64
_open_osfhandle
strchr
_snprintf
setlocale
wctomb
_get_osfhandle
toupper
wcschr
mbstowcs
wcsncpy
__p__iob
fwrite
strstr
isxdigit
isalpha
strtol
sscanf
strpbrk
strtoul
isspace
isdigit
_strnicmp
fflush
_write
getenv
gmtime
isalnum
isupper
_stati64
_ftime
LoadLibraryA
GetProcAddress
FreeLibrary
GetCurrentThreadId
GetCurrentProcessId
CloseHandle
InitializeCriticalSection
GetEnvironmentVariableA
SetEnvironmentVariableA
CreateFileA
GetFileSize
HeapAlloc
ReadFile
HeapFree
DeleteFileA
WriteFile
CreateThread
HeapReAlloc
EnterCriticalSection
LeaveCriticalSection
SetLastError
GetVersionExA
TlsAlloc
GetTempPathA
CreateDirectoryA
GetDriveTypeA
FindFirstFileA
FindClose
GetFileAttributesA
GetLastError
FindNextFileA
CopyFileA
DeleteCriticalSection
GetTempPathW
GetFileAttributesW
CreateFileW
WideCharToMultiByte
MultiByteToWideChar
IsValidCodePage
GetACP
GetOEMCP
GetFileType
PeekNamedPipe
GetFileInformationByHandle
GetExitCodeProcess
GetFullPathNameW
VerSetConditionMask
VerifyVersionInfoA
SleepEx
GetTickCount
ExpandEnvironmentStringsA
FormatMessageA
MessageBoxA
SendMessageA
PostMessageA
GetWindowThreadProcessId
IsWindowVisible
GetWindowLongA
GetForegroundWindow
IsWindowEnabled
EnableWindow
EnumWindows
SetWindowPos
DestroyWindow
GetSysColor
GetSysColorBrush
GetWindowTextLengthA
GetWindowTextA
SetRect
DrawTextA
GetSystemMetrics
ReleaseDC
CreateWindowExA
GetWindowRect
GetWindow
SetWindowLongA
InvalidateRect
SetWindowTextA
CallWindowProcA
RemovePropA
GetPropA
SetPropA
RedrawWindow
SetScrollPos
GetParent
InflateRect
GetWindowDC
DefWindowProcA
FillRect
MapWindowPoints
MoveWindow
SetActiveWindow
UnregisterClassA
DestroyAcceleratorTable
LoadIconA
LoadCursorA
RegisterClassA
AdjustWindowRectEx
ShowWindow
CreateAcceleratorTableA
PeekMessageA
MsgWaitForMultipleObjects
GetMessageA
GetActiveWindow
TranslateAcceleratorA
TranslateMessage
DispatchMessageA
DefFrameProcA
SetFocus
GetFocus
GetClientRect
EnumChildWindows
GetKeyState
GetClassNameA
IsChild
DestroyIcon
RegisterWindowMessageA
USER32.DLL
GetStockObject
SetTextColor
SetBkColor
SelectObject
GetTextExtentPoint32A
ExcludeClipRect
CreateCompatibleBitmap
GetObjectType
DeleteObject
CreateDCA
CreateCompatibleDC
DeleteDC
GetObjectA
SetStretchBltMode
StretchBlt
CreateSolidBrush
CreateBitmap
SetPixel
CreateDIBSection
GetDIBits
BitBlt
GetDeviceCaps
GDI32.DLL
RegOpenKeyExA
RegEnumValueA
CryptAcquireContextA
CryptGenRandom
CryptReleaseContext
CryptCreateHash
CryptHashData
CryptGetHashParam
CryptDestroyHash
ADVAPI32.DLL
InitCommonControlsEx
ImageList_Replace
ImageList_Add
ImageList_ReplaceIcon
ImageList_Remove
ImageList_AddMasked
ImageList_Destroy
ImageList_Create
COMCTL32.DLL
CoInitialize
CoTaskMemFree
RevokeDragDrop
OLE32.DLL
WSAIoctl
getaddrinfo
freeaddrinfo
WS2_32.DLL
closesocket
WSACleanup
WSAStartup
WSAGetLastError
WSASetLastError
getsockopt
setsockopt
socket
getpeername
getsockname
connect
select
__WSAFDIsSet
ioctlsocket
gethostname
WSOCK32.DLL